Reaction Details
TargetPlatelet-derived growth factor receptor beta
LigandBDBM50318187
Substrate/Competitorn/a
Meas. Tech.ChEMBL_632681 (CHEMBL1112819)
IC50 110100±n/a nM
Citation Gangjee, AKurup, SIhnat, MAThorpe, JEShenoy, SS Synthesis and biological activity of N(4)-phenylsubstituted-6-(2,4-dichloro phenylmethyl)-7H-pyrrolo[2,3-d]pyrimidine-2,4-diamines as vascular endothelial growth factor receptor-2 inhibitors and antiangiogenic and antitumor agents. Bioorg Med Chem18:3575-87 (2010) 
 
Platelet-derived growth factor receptor beta
Name:Platelet-derived growth factor receptor beta
Type:Enzyme
Mol. Mass.:123922.25
Organism:Homo sapiens (Human)
Description:P09619
Residue:1106
BDBM50318187
NameBDBM50318187
Synonyms:6-(2,4-dichlorobenzyl)-N-(3-(trifluoromethyl)phenyl)-7H-pyrrolo[2,3-d]pyrimidin-4-amine | CHEMBL1094784
TypeSmall organic molecule
Emp. Form.C20H13Cl2F3N4
Mol. Mass.437.245
SMILESFC(F)(F)c1cccc(Nc2ncnc3[nH]c(Cc4ccc(Cl)cc4Cl)cc23)c1