Reaction Details
TargetMetabotropic glutamate receptor 5
LigandBDBM50318376
Substrate/Competitorn/a
Meas. Tech.ChEMBL_630003 (CHEMBL1113002)
Ki 44.04±n/a nM
Citation Baumann, CAMu, LJohannsen, SHoner, MSchubiger, PAAmetamey, SM Structure-activity relationships of fluorinated (E)-3-((6-methylpyridin-2-yl)ethynyl)cyclohex-2-enone-O-methyloxime (ABP688) derivatives and the discovery of a high affinity analogue as a potential candidate for imaging metabotropic glutamate recepors subtype 5 (mGluR5) with positron emission tomog J Med Chem53:4009-17 (2010) 
 
Metabotropic glutamate receptor 5
Name:Metabotropic glutamate receptor 5
Type:Enzyme
Mol. Mass.:131900.14
Organism:Rattus norvegicus (Rat)
Description:P31424
Residue:1203
BDBM50318376
NameBDBM50318376
Synonyms:(Z)-3-(pyridin-2-ylethynyl)cyclohex-2-enone O-6-fluoropyridin-2-yl oxime | CHEMBL1098701
TypeSmall organic molecule
Emp. Form.C18H14FN3O
Mol. Mass.307.3217
SMILESFc1cccc(O\N=C2\CCCC(=C2)C#Cc2ccccn2)n1