Reaction Details
TargetMetabotropic glutamate receptor 5
LigandBDBM50318381
Substrate/Competitorn/a
Meas. Tech.ChEMBL_630003 (CHEMBL1113002)
Ki 5.42±n/a nM
Citation Baumann, CAMu, LJohannsen, SHoner, MSchubiger, PAAmetamey, SM Structure-activity relationships of fluorinated (E)-3-((6-methylpyridin-2-yl)ethynyl)cyclohex-2-enone-O-methyloxime (ABP688) derivatives and the discovery of a high affinity analogue as a potential candidate for imaging metabotropic glutamate recepors subtype 5 (mGluR5) with positron emission tomog J Med Chem53:4009-17 (2010) 
 
Metabotropic glutamate receptor 5
Name:Metabotropic glutamate receptor 5
Type:Enzyme
Mol. Mass.:131900.14
Organism:Rattus norvegicus (Rat)
Description:P31424
Residue:1203
BDBM50318381
NameBDBM50318381
Synonyms:(E)-3-(pyridin-2-ylethynyl)cyclohex-2-enone O-(3-fluoropropoxy)methyl oxime | CHEMBL1094806
TypeSmall organic molecule
Emp. Form.C17H19FN2O2
Mol. Mass.302.3434
SMILESFCCCOCO\N=C1/CCCC(=C1)C#Cc1ccccn1