Reaction Details
TargetCysteine protease
LigandBDBM50318710
Substrate/Competitorn/a
Meas. Tech.ChEMBL_633761 (CHEMBL1119325)
Ki 200±n/a nM
Citation Machon, UBüchold, CStempka, MSchirmeister, TGelhaus, CLeippe, MGut, JRosenthal, PJKisker, CLeyh, MSchmuck, C On-bead screening of a combinatorial fumaric acid derived peptide library yields antiplasmodial cysteine protease inhibitors with unusual peptide sequences. J Med Chem52:5662-72 (2009) 
 
Cysteine protease
Name:Cysteine protease
Synonyms:Rhodesain
Type:PROTEIN
Mol. Mass.:48425.78
Organism:Trypanosoma brucei rhodesiense
Description:ChEMBL_619861
Residue:450
BDBM50318710
NameBDBM50318710
TypeSmall organic molecule
Emp. Form.C43H60N8O10
Mol. Mass.848.9841
SMILESCC(C)C[C@H](NC(=O)[C@H](Cc1ccccc1)NC(=O)\C=C\C(=O)NCC(=O)NCC(=O)N[C@@H](Cc1ccccc1)C(O)=O)C(=O)N[C@@H](CC(C)C)C(=O)N[C@@H](C(C)C)C(N)=O