Reaction Details
TargetCathepsin B
LigandBDBM50318711
Substrate/Competitorn/a
Meas. Tech.ChEMBL_633764 (CHEMBL1119328)
Ki 22200±n/a nM
Citation Machon, UBüchold, CStempka, MSchirmeister, TGelhaus, CLeippe, MGut, JRosenthal, PJKisker, CLeyh, MSchmuck, C On-bead screening of a combinatorial fumaric acid derived peptide library yields antiplasmodial cysteine protease inhibitors with unusual peptide sequences. J Med Chem52:5662-72 (2009) 
 
Cathepsin B
Name:Cathepsin B
Type:Enzyme
Mol. Mass.:37819.69
Organism:Homo sapiens (Human)
Description:gi_63102437
Residue:339
BDBM50318711
NameBDBM50318711
Synonyms:(2S,15S,18S,21S,24S)-15-(2-amino-2-oxoethyl)-2-benzyl-24-carbamoyl-18-cyclohexyl-21,25-dimethyl-4,7,10,13,16,19,22-heptaoxo-3,6,9,14,17,20,23-heptaazahexacos-11-en-1-oic acid | CHEMBL1086431
TypeSmall organic molecule
Emp. Form.C37H53N9O11
Mol. Mass.799.8704
SMILESCC(C)[C@H](NC(=O)[C@H](C)NC(=O)[C@@H](NC(=O)[C@H](CC(N)=O)NC(=O)\C=C\C(=O)NCC(=O)NCC(=O)N[C@@H](Cc1ccccc1)C(O)=O)C1CCCCC1)C(N)=O