Reaction Details
TargetAcetylcholinesterase
LigandBDBM50039733
Substrate/Competitorn/a
Meas. Tech.ChEMBL_633769 (CHEMBL1119333)
IC50 220±n/a nM
Citation Lv, WXue, Y Prediction of acetylcholinesterase inhibitors and characterization of correlative molecular descriptors by machine learning methods. Eur J Med Chem45:1167-72 (2010) 
 
Acetylcholinesterase
Name:Acetylcholinesterase
Type:Enzyme
Mol. Mass.:67792.70
Organism:Homo sapiens (Human)
Description:P22303
Residue:614
BDBM50039733
NameBDBM50039733
Synonyms:1-(2-(1-benzylpiperidin-4-yl)ethyl)isoquinoline CHEMBL92142
TypeSmall organic molecule
Emp. Form.C23H26N2
Mol. Mass.330.4659
SMILESC(Cc1nccc2ccccc12)C1CCN(Cc2ccccc2)CC1