Reaction Details
TargetProstaglandin E2 receptor EP4 subtype
LigandBDBM50318871
Substrate/Competitorn/a
Meas. Tech.ChEMBL_633616 (CHEMBL1117759)
EC50 1.6±n/a nM
Citation Allen, JGFotsch, CBabij, P Emerging targets in osteoporosis disease modification. J Med Chem53:4332-53 (2010) 
 
Prostaglandin E2 receptor EP4 subtype
Name:Prostaglandin E2 receptor EP4 subtype
Type:G-protein coupled receptor
Mol. Mass.:56175.66
Organism:Mus musculus (Mouse)
Description:n/a
Residue:513
BDBM50318871
NameBDBM50318871
Synonyms:4-(2-{(1R,2R,3R)-3-Hydroxy-2-[(E)-(S)-3-hydroxy-4-(3-methoxymethyl-phenyl)-but-1-enyl]-5-oxo-cyclopentyl}-ethylsulfanyl)-butyric acid methyl ester methyl 4-(2-((1R,2R,3R)-3-hydroxy-2-((S,E)-3-hydroxy-4-(3-(methoxymethyl)phenyl)but-1-enyl)-5-oxocyclopentyl)ethylthio)butanoate
TypeSmall organic molecule
Emp. Form.C24H34O6S
Mol. Mass.450.588
SMILESCOCc1cccc(C[C@H](O)\C=C\[C@H]2[C@H](O)CC(=O)[C@@H]2CCSCCCC(=O)OC)c1