Reaction Details
TargetProstaglandin E2 receptor EP4 subtype
LigandBDBM50181298
Substrate/Competitorn/a
Meas. Tech.ChEMBL_633534 (CHEMBL1119848)
EC50 0.5±n/a nM
Citation Allen, JGFotsch, CBabij, P Emerging targets in osteoporosis disease modification. J Med Chem53:4332-53 (2010) 
 
Prostaglandin E2 receptor EP4 subtype
Name:Prostaglandin E2 receptor EP4 subtype
Type:PROTEIN
Mol. Mass.:53381.95
Organism:Rattus norvegicus
Description:ChEMBL_1290039
Residue:488
BDBM50181298
NameBDBM50181298
Synonyms:5-(3-((S)-2-((R)-3-hydroxy-4-(3-(trifluoromethyl)phenyl)butyl)-5-oxopyrrolidin-1-yl)propyl)thiophene-2-carboxylic acid | CHEMBL378376
TypeSmall organic molecule
Emp. Form.C23H26F3NO4S
Mol. Mass.469.517
SMILESO[C@H](CC[C@H]1CCC(=O)N1CCCc1ccc(s1)C(O)=O)Cc1cccc(c1)C(F)(F)F