Reaction Details
TargetCannabinoid receptor 2
LigandBDBM50180036
Substrate/Competitorn/a
Meas. Tech.ChEMBL_633626 (CHEMBL1117884)
Ki 3.4±n/a nM
Citation Allen, JGFotsch, CBabij, P Emerging targets in osteoporosis disease modification. J Med Chem53:4332-53 (2010) 
 
Cannabinoid receptor 2
Name:Cannabinoid receptor 2
Type:G Protein-Coupled Receptor (GPCR)
Mol. Mass.:39690.94
Organism:Homo sapiens (Human)
Description:P34972
Residue:360
BDBM50180036
NameBDBM50180036
Synonyms:(6aR,10aR)-3-(1,1-dimethylbutyl)-6a,7,10,10a-tetrahydro-6,6,9-trimethyl-6Hdibenzo[b,d]pyran CHEMBL371214 | JWH-133
TypeSmall organic molecule
Emp. Form.C22H32O
Mol. Mass.312.4889
SMILESCCCC(C)(C)c1ccc2[C@@H]3CC(C)=CC[C@H]3C(C)(C)Oc2c1