Reaction Details
TargetProstaglandin E2 receptor EP2 subtype
LigandBDBM50101858
Substrate/Competitorn/a
Meas. Tech.ChEMBL_633613 (CHEMBL1117756)
Ki 620±n/a nM
Citation Allen, JGFotsch, CBabij, P Emerging targets in osteoporosis disease modification. J Med Chem53:4332-53 (2010) 
 
Prostaglandin E2 receptor EP2 subtype
Name:Prostaglandin E2 receptor EP2 subtype
Type:G-protein coupled receptor
Mol. Mass.:40495.26
Organism:Mus musculus (Mouse)
Description:n/a
Residue:362
BDBM50101858
NameBDBM50101858
Synonyms:4-(2-((1R,2R,3R)-3-hydroxy-2-((S,E)-3-hydroxy-4-(3-(methoxymethyl)phenyl)but-1-enyl)-5-oxocyclopentyl)ethylthio)butanoic acid CHEMBL292964
TypeSmall organic molecule
Emp. Form.C23H32O6S
Mol. Mass.436.562
SMILESCOCc1cccc(C[C@H](O)\C=C\[C@H]2[C@H](O)CC(=O)[C@@H]2CCSCCCC(O)=O)c1