Reaction Details
TargetExtracellular calcium-sensing receptor
LigandBDBM50318873
Substrate/Competitorn/a
Meas. Tech.ChEMBL_633356 (CHEMBL1120576)
IC50 25±n/a nM
Citation Allen, JGFotsch, CBabij, P Emerging targets in osteoporosis disease modification. J Med Chem53:4332-53 (2010) 
 
Extracellular calcium-sensing receptor
Name:Extracellular calcium-sensing receptor
Type:Protein
Mol. Mass.:120663.13
Organism:Homo sapiens (Human)
Description:P41180
Residue:1078
BDBM50318873
NameBDBM50318873
Synonyms:(1S,2S,3R,4R,5S)-6-{2-[(1R)-1-[(2R)-3-{[1-(3-fluoro-4-methylphenyl)-2-methylpropan-2-yl]amino}-2-hydroxypropoxy]ethyl]phenyl}tricyclo[3.2.1.0^{2,4}]octane-3-carboxylic acid | CHEMBL1084156
TypeSmall organic molecule
Emp. Form.C31H40FNO4
Mol. Mass.509.652
SMILESC[C@@H](OC[C@H](O)CNC(C)(C)Cc1ccc(C)c(F)c1)c1ccccc1C1C[C@@H]2C[C@H]1[C@@H]1[C@H]2[C@H]1C(O)=O