Reaction Details
TargetIntegrin alpha-V/beta-3
LigandBDBM50162757
Substrate/Competitorn/a
Meas. Tech.ChEMBL_633353 (CHEMBL1120573)
IC50 0.24±n/a nM
Citation Allen, JGFotsch, CBabij, P Emerging targets in osteoporosis disease modification. J Med Chem53:4332-53 (2010) 
 
Integrin alpha-V/beta-3
Name:Integrin alpha-V/beta-3
Type:Enzyme
Mol. Mass.:n/a
Description:n/a
Components:This complex has 2 components.
Component 1
Name:Integrin alpha-V
Synonyms:ITAV_HUMAN Integrin alpha-V/alpha-5 VNRA Vitronectin receptor | Vitronectin receptor subunit alpha
Type:PROTEIN
Mol. Mass.:116024.92
Organism:Homo sapiens (Human)
Description:ChEMBL_582336
Residue:1048
Component 2
Name:Integrin beta-3
Synonyms:CD_antigen=CD61 GPIIIa ITGB3 Platelet membrane glycoprotein IIIa
Type:Protein
Mol. Mass.:87038.91
Organism:Homo sapiens (Human)
Description:P05106
Residue:788
BDBM50162757
NameBDBM50162757
Synonyms:(3S,7S)-7-Hydroxy-3-(6-methoxy-pyridin-3-yl)-9-(5,6,7,8-tetrahydro-[1,8]naphthyridin-2-yl)-nonanoic acid CHEMBL179069
TypeSmall organic molecule
Emp. Form.C23H31N3O4
Mol. Mass.413.5099
SMILESCOc1ccc(cn1)[C@@H](CCC[C@H](O)CCc1ccc2CCCNc2n1)CC(O)=O