Reaction Details
TargetCathepsin K
LigandBDBM50253098
Substrate/Competitorn/a
Meas. Tech.ChEMBL_633771 (CHEMBL1119721)
IC50 0.62±n/a nM
Citation Allen, JGFotsch, CBabij, P Emerging targets in osteoporosis disease modification. J Med Chem53:4332-53 (2010) 
 
Cathepsin K
Name:Cathepsin K
Type:Enzyme
Mol. Mass.:36975.68
Organism:Homo sapiens (Human)
Description:P43235
Residue:329
BDBM50253098
NameBDBM50253098
Synonyms:(1R,2R)-5,5-Dichloro-N-(1-cyanocyclopropyl)-2-[4-[4-(methylsulfonyl)phenyl]-1-(2,2,2-trifluoroethyl)-1H-pyrazol-3-yl]cyclohexanecarboxamide CHEMBL523352 | MK-1256
TypeSmall organic molecule
Emp. Form.C23H23Cl2F3N4O3S
Mol. Mass.563.42
SMILESCS(=O)(=O)c1ccc(cc1)-c1cn(CC(F)(F)F)nc1[C@@H]1CCC(Cl)(Cl)C[C@H]1C(=O)NC1(CC1)C#N