Reaction Details
TargetCathepsin K
LigandBDBM50318881
Substrate/Competitorn/a
Meas. Tech.ChEMBL_633770 (CHEMBL1119720)
Ki 2.5±n/a nM
Citation Allen, JGFotsch, CBabij, P Emerging targets in osteoporosis disease modification. J Med Chem53:4332-53 (2010) 
 
Cathepsin K
Name:Cathepsin K
Type:Enzyme
Mol. Mass.:36975.68
Organism:Homo sapiens (Human)
Description:P43235
Residue:329
BDBM50318881
NameBDBM50318881
Synonyms:CHEMBL1086008 | N-(1-((2S,3S)-2-ethyl-4-oxotetrahydrofuran-3-ylcarbamoyl)cyclohexyl)-4-(2-(4-methylpiperazin-1-yl)thiazol-4-yl)benzamide
TypeSmall organic molecule
Emp. Form.C28H37N5O4S
Mol. Mass.539.689
SMILESCC[C@@H]1OCC(=O)[C@H]1NC(=O)C1(CCCCC1)NC(=O)c1ccc(cc1)-c1csc(n1)N1CCN(C)CC1