Reaction Details
TargetCathepsin K
LigandBDBM50318880
Substrate/Competitorn/a
Meas. Tech.ChEMBL_633322 (CHEMBL1120161)
IC50 58±n/a nM
Citation Allen, JGFotsch, CBabij, P Emerging targets in osteoporosis disease modification. J Med Chem53:4332-53 (2010) 
 
Cathepsin K
Name:Cathepsin K
Type:PROTEIN
Mol. Mass.:36798.82
Organism:Rattus norvegicus
Description:ChEMBL_633322
Residue:329
BDBM50318880
NameBDBM50318880
Synonyms:(S)-2-(4-(2-(1-(biphenyl-3-ylamino)cyclohexanecarboxamido)butylamino)phenoxy)acetic acid | CHEMBL1083675
TypeSmall organic molecule
Emp. Form.C31H37N3O4
Mol. Mass.515.6432
SMILESCC[C@@H](CNc1ccc(OCC(O)=O)cc1)NC(=O)C1(CCCCC1)Nc1cccc(c1)-c1ccccc1