Reaction Details
TargetSubstance-P receptor
LigandBDBM50318927
Substrate/Competitorn/a
Meas. Tech.ChEMBL_635273 (CHEMBL1118377)
Ki 1.58±n/a nM
Citation Peters, JUHoffmann, TSchnider, PStadler, HKoblet, AAlker, APoli, SMBallard, TMSpooren, WSteward, LSleight, AJ Discovery of potent, balanced and orally active dual NK1/NK3 receptor ligands. Bioorg Med Chem Lett20:3405-8 (2010) 
 
Substance-P receptor
Name:Substance-P receptor
Type:G Protein-Coupled Receptor (GPCR)
Mol. Mass.:46254.43
Organism:Homo sapiens (Human)
Description:P25103
Residue:407
BDBM50318927
NameBDBM50318927
Synonyms:2-(3,5-bis(trifluoromethyl)phenyl)-N-(4-(2-chlorophenyl)-6-((2R,3S)-3-hydroxy-2-(hydroxymethyl)pyrrolidin-1-yl)pyridin-3-yl)-N,2-dimethylpropanamide | CHEMBL1084439
TypeSmall organic molecule
Emp. Form.C29H28ClF6N3O3
Mol. Mass.615.994
SMILESCN(C(=O)C(C)(C)c1cc(cc(c1)C(F)(F)F)C(F)(F)F)c1cnc(cc1-c1ccccc1Cl)N1CC[C@H](O)[C@H]1CO