Reaction Details
TargetNeuromedin-K receptor
LigandBDBM50318930
Substrate/Competitorn/a
Meas. Tech.ChEMBL_635274 (CHEMBL1118378)
Ki 2.91±n/a nM
Citation Peters, JUHoffmann, TSchnider, PStadler, HKoblet, AAlker, APoli, SMBallard, TMSpooren, WSteward, LSleight, AJ Discovery of potent, balanced and orally active dual NK1/NK3 receptor ligands. Bioorg Med Chem Lett20:3405-8 (2010) 
 
Neuromedin-K receptor
Name:Neuromedin-K receptor
Type:Enzyme
Mol. Mass.:52221.96
Organism:Homo sapiens (Human)
Description:P29371
Residue:465
BDBM50318930
NameBDBM50318930
Synonyms:2-(3,5-bis(trifluoromethyl)phenyl)-N-(4-(2-chlorophenyl)-6-((2-hydroxyethyl)(methyl)amino)pyridin-3-yl)-N,2-dimethylpropanamide | CHEMBL1082415
TypeSmall organic molecule
Emp. Form.C27H26ClF6N3O2
Mol. Mass.573.958
SMILESCN(CCO)c1cc(c(cn1)N(C)C(=O)C(C)(C)c1cc(cc(c1)C(F)(F)F)C(F)(F)F)-c1ccccc1Cl