Reaction Details
TargetBeta-2 adrenergic receptor
LigandBDBM50318978
Substrate/Competitorn/a
Meas. Tech.ChEMBL_635468 (CHEMBL1120618)
Ki 7±n/a nM
Citation Tasler, SBaumgartner, RAschenbrenner, AAmmendola, AWolf, KWieber, TSchachtner, JBlisse, MQuotschalla, UNey, P A vHTS approach for the identification of beta-adrenoceptor ligands. Bioorg Med Chem Lett20:3399-404 (2010) 
 
Beta-2 adrenergic receptor
Name:Beta-2 adrenergic receptor
Type:n/a
Mol. Mass.:46461.69
Organism:Homo sapiens (Human)
Description:P07550
Residue:413
BDBM50318978
NameBDBM50318978
Synonyms:1-(2-allylphenoxy)-3-morpholinopropan-2-ol | CHEMBL1083667
TypeSmall organic molecule
Emp. Form.C16H23NO3
Mol. Mass.277.3587
SMILESOC(COc1ccccc1CC=C)CN1CCOCC1