Reaction Details
TargetBeta-2 adrenergic receptor
LigandBDBM50318980
Substrate/Competitorn/a
Meas. Tech.ChEMBL_635468 (CHEMBL1120618)
Ki 2.4±n/a nM
Citation Tasler, SBaumgartner, RAschenbrenner, AAmmendola, AWolf, KWieber, TSchachtner, JBlisse, MQuotschalla, UNey, P A vHTS approach for the identification of beta-adrenoceptor ligands. Bioorg Med Chem Lett20:3399-404 (2010) 
 
Beta-2 adrenergic receptor
Name:Beta-2 adrenergic receptor
Type:n/a
Mol. Mass.:46461.69
Organism:Homo sapiens (Human)
Description:P07550
Residue:413
BDBM50318980
NameBDBM50318980
Synonyms:1-(2-allylphenoxy)-3-(1-methylpiperidin-4-ylamino)propan-2-ol | CHEMBL1083669
TypeSmall organic molecule
Emp. Form.C18H28N2O2
Mol. Mass.304.4271
SMILESCN1CCC(CC1)NCC(O)COc1ccccc1CC=C