Reaction Details
TargetBeta-2 adrenergic receptor
LigandBDBM50318983
Substrate/Competitorn/a
Meas. Tech.ChEMBL_635468 (CHEMBL1120618)
Ki 8±n/a nM
Citation Tasler, SBaumgartner, RAschenbrenner, AAmmendola, AWolf, KWieber, TSchachtner, JBlisse, MQuotschalla, UNey, P A vHTS approach for the identification of beta-adrenoceptor ligands. Bioorg Med Chem Lett20:3399-404 (2010) 
 
Beta-2 adrenergic receptor
Name:Beta-2 adrenergic receptor
Type:n/a
Mol. Mass.:46461.69
Organism:Homo sapiens (Human)
Description:P07550
Residue:413
BDBM50318983
NameBDBM50318983
Synonyms:2-((1-(3-(9H-carbazol-4-yloxy)-2-hydroxypropyl)piperidin-4-yl)methyl)-5-methoxy-1H-benzo[de]isoquinoline-1,3(2H)-dione | CHEMBL1084707
TypeSmall organic molecule
Emp. Form.C34H33N3O5
Mol. Mass.563.6429
SMILESCOc1cc2C(=O)N(CC3CCN(CC(O)COc4cccc5[nH]c6ccccc6c45)CC3)C(=O)c3cccc(c1)c23