Reaction Details
TargetBeta-2 adrenergic receptor
LigandBDBM50318987
Substrate/Competitorn/a
Meas. Tech.ChEMBL_635468 (CHEMBL1120618)
Ki 0.100000±n/a nM
Citation Tasler, SBaumgartner, RAschenbrenner, AAmmendola, AWolf, KWieber, TSchachtner, JBlisse, MQuotschalla, UNey, P A vHTS approach for the identification of beta-adrenoceptor ligands. Bioorg Med Chem Lett20:3399-404 (2010) 
 
Beta-2 adrenergic receptor
Name:Beta-2 adrenergic receptor
Type:n/a
Mol. Mass.:46461.69
Organism:Homo sapiens (Human)
Description:P07550
Residue:413
BDBM50318987
NameBDBM50318987
Synonyms:1-(9H-carbazol-4-yloxy)-3-(4-(pyridin-3-ylmethyl)piperidin-1-yl)propan-2-ol | CHEMBL1082501
TypeSmall organic molecule
Emp. Form.C26H29N3O2
Mol. Mass.415.5274
SMILESOC(COc1cccc2[nH]c3ccccc3c12)CN1CCC(Cc2cccnc2)CC1