Reaction Details
TargetBeta-2 adrenergic receptor
LigandBDBM50318992
Substrate/Competitorn/a
Meas. Tech.ChEMBL_635468 (CHEMBL1120618)
Ki 80±n/a nM
Citation Tasler, SBaumgartner, RAschenbrenner, AAmmendola, AWolf, KWieber, TSchachtner, JBlisse, MQuotschalla, UNey, P A vHTS approach for the identification of beta-adrenoceptor ligands. Bioorg Med Chem Lett20:3399-404 (2010) 
 
Beta-2 adrenergic receptor
Name:Beta-2 adrenergic receptor
Type:n/a
Mol. Mass.:46461.69
Organism:Homo sapiens (Human)
Description:P07550
Residue:413
BDBM50318992
NameBDBM50318992
Synonyms:2-((1-(3-(2-allylphenoxy)-2-hydroxypropyl)piperidin-4-yl)methyl)-1H-benzo[de]isoquinoline-1,3(2H)-dione | CHEMBL1086005
TypeSmall organic molecule
Emp. Form.C30H32N2O4
Mol. Mass.484.5861
SMILESOC(COc1ccccc1CC=C)CN1CCC(CN2C(=O)c3cccc4cccc(C2=O)c34)CC1