Reaction Details
TargetBeta-2 adrenergic receptor
LigandBDBM50319003
Substrate/Competitorn/a
Meas. Tech.ChEMBL_635468 (CHEMBL1120618)
Ki 40±n/a nM
Citation Tasler, SBaumgartner, RAschenbrenner, AAmmendola, AWolf, KWieber, TSchachtner, JBlisse, MQuotschalla, UNey, P A vHTS approach for the identification of beta-adrenoceptor ligands. Bioorg Med Chem Lett20:3399-404 (2010) 
 
Beta-2 adrenergic receptor
Name:Beta-2 adrenergic receptor
Type:n/a
Mol. Mass.:46461.69
Organism:Homo sapiens (Human)
Description:P07550
Residue:413
BDBM50319003
NameBDBM50319003
Synonyms:2-(1-(3-(2-allylphenoxy)-2-hydroxypropyl)piperidin-4-yl)-1H-benzo[de]isoquinoline-1,3(2H)-dione | CHEMBL1083364
TypeSmall organic molecule
Emp. Form.C29H30N2O4
Mol. Mass.470.5595
SMILESOC(COc1ccccc1CC=C)CN1CCC(CC1)N1C(=O)c2cccc3cccc(C1=O)c23