Reaction Details
TargetBeta-3 adrenergic receptor
LigandBDBM50318986
Substrate/Competitorn/a
Meas. Tech.ChEMBL_635476 (CHEMBL1117710)
Ki 455±n/a nM
Citation Tasler, SBaumgartner, RAschenbrenner, AAmmendola, AWolf, KWieber, TSchachtner, JBlisse, MQuotschalla, UNey, P A vHTS approach for the identification of beta-adrenoceptor ligands. Bioorg Med Chem Lett20:3399-404 (2010) 
 
Beta-3 adrenergic receptor
Name:Beta-3 adrenergic receptor
Type:G Protein-Coupled Receptor (GPCR)
Mol. Mass.:43534.88
Organism:Homo sapiens (Human)
Description:n/a
Residue:408
BDBM50318986
NameBDBM50318986
Synonyms:1-(9H-carbazol-4-yloxy)-3-(4-(4-methoxybenzyl)piperidin-1-yl)propan-2-ol | CHEMBL1082500
TypeSmall organic molecule
Emp. Form.C28H32N2O3
Mol. Mass.444.5653
SMILESCOc1ccc(CC2CCN(CC(O)COc3cccc4[nH]c5ccccc5c34)CC2)cc1