Reaction Details
TargetBeta-1 adrenergic receptor
LigandBDBM50318987
Substrate/Competitorn/a
Meas. Tech.ChEMBL_635472 (CHEMBL1120622)
Ki 1±n/a nM
Citation Tasler, SBaumgartner, RAschenbrenner, AAmmendola, AWolf, KWieber, TSchachtner, JBlisse, MQuotschalla, UNey, P A vHTS approach for the identification of beta-adrenoceptor ligands. Bioorg Med Chem Lett20:3399-404 (2010) 
 
Beta-1 adrenergic receptor
Name:Beta-1 adrenergic receptor
Type:G Protein-Coupled Receptor (GPCR)
Mol. Mass.:51338.40
Organism:Homo sapiens (Human)
Description:P08588
Residue:477
BDBM50318987
NameBDBM50318987
Synonyms:1-(9H-carbazol-4-yloxy)-3-(4-(pyridin-3-ylmethyl)piperidin-1-yl)propan-2-ol | CHEMBL1082501
TypeSmall organic molecule
Emp. Form.C26H29N3O2
Mol. Mass.415.5274
SMILESOC(COc1cccc2[nH]c3ccccc3c12)CN1CCC(Cc2cccnc2)CC1