Reaction Details
TargetRho-associated protein kinase 1
LigandBDBM50319007
Substrate/Competitorn/a
Meas. Tech.ChEMBL_635486 (CHEMBL1117720)
IC50 1200±n/a nM
Citation Davis, RLKahraman, MPrins, TJBeaver, YCook, TGCramp, JCayanan, CSGardiner, EMMcLaughlin, MAClark, AFHellberg, MRShiau, AKNoble, SABorchardt, AJ Benzothiophene containing Rho kinase inhibitors: Efficacy in an animal model of glaucoma. Bioorg Med Chem Lett20:3361-6 (2010) 
 
Rho-associated protein kinase 1
Name:Rho-associated protein kinase 1
Type:Serine/threonine-protein kinase
Mol. Mass.:158156.77
Organism:Homo sapiens (Human)
Description:Q13464
Residue:1354
BDBM50319007
NameBDBM50319007
Synonyms:4-(5-chloro-3-methylbenzo[b]thiophen-2-yl)-N-methylpyrimidin-2-amine | CHEMBL1086078
TypeSmall organic molecule
Emp. Form.C14H12ClN3S
Mol. Mass.289.783
SMILESCNc1nccc(n1)-c1sc2ccc(Cl)cc2c1C