Reaction Details
TargetRho-associated protein kinase 1
LigandBDBM50319013
Substrate/Competitorn/a
Meas. Tech.ChEMBL_635486 (CHEMBL1117720)
IC50>10000±n/a nM
Citation Davis, RLKahraman, MPrins, TJBeaver, YCook, TGCramp, JCayanan, CSGardiner, EMMcLaughlin, MAClark, AFHellberg, MRShiau, AKNoble, SABorchardt, AJ Benzothiophene containing Rho kinase inhibitors: Efficacy in an animal model of glaucoma. Bioorg Med Chem Lett20:3361-6 (2010) 
 
Rho-associated protein kinase 1
Name:Rho-associated protein kinase 1
Type:Serine/threonine-protein kinase
Mol. Mass.:158156.77
Organism:Homo sapiens (Human)
Description:Q13464
Residue:1354
BDBM50319013
NameBDBM50319013
Synonyms:3-(5-chloro-3-methylbenzo[b]thiophen-2-yl)-1H-pyrrolo[2,3-b]pyridine | CHEMBL1086321
TypeSmall organic molecule
Emp. Form.C16H11ClN2S
Mol. Mass.298.79
SMILESCc1c(sc2ccc(Cl)cc12)-c1c[nH]c2ncccc12