Reaction Details
TargetRho-associated protein kinase 1
LigandBDBM50319030
Substrate/Competitorn/a
Meas. Tech.ChEMBL_635486 (CHEMBL1117720)
IC50 50±n/a nM
Citation Davis, RLKahraman, MPrins, TJBeaver, YCook, TGCramp, JCayanan, CSGardiner, EMMcLaughlin, MAClark, AFHellberg, MRShiau, AKNoble, SABorchardt, AJ Benzothiophene containing Rho kinase inhibitors: Efficacy in an animal model of glaucoma. Bioorg Med Chem Lett20:3361-6 (2010) 
 
Rho-associated protein kinase 1
Name:Rho-associated protein kinase 1
Type:Serine/threonine-protein kinase
Mol. Mass.:158156.77
Organism:Homo sapiens (Human)
Description:Q13464
Residue:1354
BDBM50319030
NameBDBM50319030
Synonyms:(+/-)--4-(5-(amino(m-tolyl)methyl)-3-methylbenzo[b]thiophen-2-yl)pyrimidin-2-amine | CHEMBL1083351
TypeSmall organic molecule
Emp. Form.C21H20N4S
Mol. Mass.360.475
SMILESCc1c(sc2ccc(cc12)C(N)c1cccc(C)c1)-c1ccnc(N)n1