Reaction Details
TargetRho-associated protein kinase 1
LigandBDBM50319032
Substrate/Competitorn/a
Meas. Tech.ChEMBL_635486 (CHEMBL1117720)
IC50 2200±n/a nM
Citation Davis, RLKahraman, MPrins, TJBeaver, YCook, TGCramp, JCayanan, CSGardiner, EMMcLaughlin, MAClark, AFHellberg, MRShiau, AKNoble, SABorchardt, AJ Benzothiophene containing Rho kinase inhibitors: Efficacy in an animal model of glaucoma. Bioorg Med Chem Lett20:3361-6 (2010) 
 
Rho-associated protein kinase 1
Name:Rho-associated protein kinase 1
Type:Serine/threonine-protein kinase
Mol. Mass.:158156.77
Organism:Homo sapiens (Human)
Description:Q13464
Residue:1354
BDBM50319032
NameBDBM50319032
Synonyms:4-(5-(aminomethyl)-3-methylbenzo[b]thiophen-2-yl)pyrimidin-2-amine | CHEMBL1085700
TypeSmall organic molecule
Emp. Form.C14H14N4S
Mol. Mass.270.353
SMILESCc1c(sc2ccc(CN)cc12)-c1ccnc(N)n1