Reaction Details
TargetRho-associated protein kinase 1
LigandBDBM50319018
Substrate/Competitorn/a
Meas. Tech.ChEMBL_635489 (CHEMBL1117723)
EC50>10000±n/a nM
Citation Davis, RLKahraman, MPrins, TJBeaver, YCook, TGCramp, JCayanan, CSGardiner, EMMcLaughlin, MAClark, AFHellberg, MRShiau, AKNoble, SABorchardt, AJ Benzothiophene containing Rho kinase inhibitors: Efficacy in an animal model of glaucoma. Bioorg Med Chem Lett20:3361-6 (2010) 
 
Rho-associated protein kinase 1
Name:Rho-associated protein kinase 1
Type:Serine/threonine-protein kinase
Mol. Mass.:158156.77
Organism:Homo sapiens (Human)
Description:Q13464
Residue:1354
BDBM50319018
NameBDBM50319018
Synonyms:4-(5-(3-methoxybenzyl)-3-methylbenzo[b]thiophen-2-yl)pyrimidin-2-amine | CHEMBL1086544
TypeSmall organic molecule
Emp. Form.C21H19N3OS
Mol. Mass.361.46
SMILESCOc1cccc(Cc2ccc3sc(c(C)c3c2)-c2ccnc(N)n2)c1