Reaction Details
TargetRho-associated protein kinase 1
LigandBDBM50319025
Substrate/Competitorn/a
Meas. Tech.ChEMBL_635489 (CHEMBL1117723)
EC50 1000±n/a nM
Citation Davis, RLKahraman, MPrins, TJBeaver, YCook, TGCramp, JCayanan, CSGardiner, EMMcLaughlin, MAClark, AFHellberg, MRShiau, AKNoble, SABorchardt, AJ Benzothiophene containing Rho kinase inhibitors: Efficacy in an animal model of glaucoma. Bioorg Med Chem Lett20:3361-6 (2010) 
 
Rho-associated protein kinase 1
Name:Rho-associated protein kinase 1
Type:Serine/threonine-protein kinase
Mol. Mass.:158156.77
Organism:Homo sapiens (Human)
Description:Q13464
Residue:1354
BDBM50319025
NameBDBM50319025
Synonyms:3-(2-(2-aminopyrimidin-4-yl)-3-methylbenzo[b]thiophen-5-ylamino)phenol | CHEMBL1083072
TypeSmall organic molecule
Emp. Form.C19H16N4OS
Mol. Mass.348.422
SMILESCc1c(sc2ccc(Nc3cccc(O)c3)cc12)-c1ccnc(N)n1