Reaction Details
TargetRho-associated protein kinase 1
LigandBDBM50319037
Substrate/Competitorn/a
Meas. Tech.ChEMBL_635489 (CHEMBL1117723)
EC50 1400±n/a nM
Citation Davis, RLKahraman, MPrins, TJBeaver, YCook, TGCramp, JCayanan, CSGardiner, EMMcLaughlin, MAClark, AFHellberg, MRShiau, AKNoble, SABorchardt, AJ Benzothiophene containing Rho kinase inhibitors: Efficacy in an animal model of glaucoma. Bioorg Med Chem Lett20:3361-6 (2010) 
 
Rho-associated protein kinase 1
Name:Rho-associated protein kinase 1
Type:Serine/threonine-protein kinase
Mol. Mass.:158156.77
Organism:Homo sapiens (Human)
Description:Q13464
Residue:1354
BDBM50319037
NameBDBM50319037
Synonyms:(+/-)-4-(5-(1-amino-3-methylbutyl)-3-methylbenzo[b]thiophen-2-yl)pyrimidin-2-amine | CHEMBL1082439
TypeSmall organic molecule
Emp. Form.C18H22N4S
Mol. Mass.326.459
SMILESCC(C)CC(N)c1ccc2sc(c(C)c2c1)-c1ccnc(N)n1