Reaction Details
TargetHydroxycarboxylic acid receptor 2
LigandBDBM50319109
Substrate/Competitorn/a
Meas. Tech.ChEMBL_635632 (CHEMBL1119082)
IC50 4±n/a nM
Citation Schmidt, DSmenton, ARaghavan, SShen, HDing, FXCarballo-Jane, ELuell, SCiecko, THolt, TGWolff, MTaggart, AWilsie, LKrsmanovic, MRen, NBlom, DCheng, KMcCann, PEWaters, MGTata, JColletti, S Anthranilic acid replacements in a niacin receptor agonist. Bioorg Med Chem Lett20:3426-30 (2010) 
 
Hydroxycarboxylic acid receptor 2
Name:Hydroxycarboxylic acid receptor 2
Type:G Protein-Coupled Receptor (GPCR)
Mol. Mass.:41868.22
Organism:Homo sapiens (Human)
Description:Membranes from CHO cells expressing the recombinant human GPR109A were used in competition binding assay.
Residue:363
BDBM50319109
NameBDBM50319109
Synonyms:2-(3-(3-(5-hydroxypyridin-2-yl)-1,2,4-oxadiazol-5-yl)propanamido)-5-propylcyclohex-1-enecarboxylic acid | CHEMBL1084576
TypeSmall organic molecule
Emp. Form.C20H24N4O5
Mol. Mass.400.4284
SMILESCCCC1CCC(NC(=O)CCc2nc(no2)-c2ccc(O)cn2)=C(C1)C(O)=O