Reaction Details
TargetP2Y purinoceptor 4
LigandBDBM50319141
Substrate/Competitorn/a
Meas. Tech.ChEMBL_635652 (CHEMBL1119544)
EC50 180±n/a nM
Citation Maruoka, HBarrett, MOKo, HTosh, DKMelman, ABurianek, LEBalasubramanian, RBerk, BCostanzi, SHarden, TKJacobson, KA Pyrimidine ribonucleotides with enhanced selectivity as P2Y(6) receptor agonists: novel 4-alkyloxyimino, (S)-methanocarba, and 5'-triphosphate gamma-ester modifications. J Med Chem53:4488-501 (2010) 
 
P2Y purinoceptor 4
Name:P2Y purinoceptor 4
Type:PROTEIN
Mol. Mass.:40977.17
Organism:Homo sapiens (Human)
Description:ChEMBL_751027
Residue:365
BDBM50319141
NameBDBM50319141
Synonyms:CHEMBL1084295 | N4-Ethoxycytidine 5'-Diphosphate triethylAmmonium Salt
TypeSmall organic molecule
Emp. Form.C11H19N3O12P2
Mol. Mass.447.229
SMILESCCONc1ccn([C@@H]2O[C@H](COP(O)(=O)OP(O)(O)=O)[C@@H](O)[C@H]2O)c(=O)n1