Reaction Details
TargetcAMP and cAMP-inhibited cGMP 3',5'-cyclic phosphodiesterase 10A
LigandBDBM50319160
Substrate/Competitorn/a
Meas. Tech.ChEMBL_635680 (CHEMBL1119709)
IC50 12±n/a nM
Citation Höfgen, NStange, HSchindler, RLankau, HJGrunwald, CLangen, BEgerland, UTremmel, PPangalos, MNMarquis, KLHage, THarrison, BLMalamas, MSBrandon, NJKronbach, T Discovery of imidazo[1,5-a]pyrido[3,2-e]pyrazines as a new class of phosphodiesterase 10A inhibitiors. J Med Chem53:4399-411 (2010) 
 
cAMP and cAMP-inhibited cGMP 3',5'-cyclic phosphodiesterase 10A
Name:cAMP and cAMP-inhibited cGMP 3',5'-cyclic phosphodiesterase 10A
Type:Protein
Mol. Mass.:88412.52
Organism:Homo sapiens (Human)
Description:Q9Y233
Residue:1055
BDBM50319160
NameBDBM50319160
Synonyms:4-Ethyl-8-methoxy-3-methyl-1-propyl-imidazo[1,5-a]pyrido[3,2-e]pyrazine | CHEMBL1084964
TypeSmall organic molecule
Emp. Form.C16H20N4O
Mol. Mass.284.3562
SMILESCCCc1nc(C)c2c(CC)nc3ccc(OC)nc3n12