Reaction Details
TargetcAMP and cAMP-inhibited cGMP 3',5'-cyclic phosphodiesterase 10A
LigandBDBM50319187
Substrate/Competitorn/a
Meas. Tech.ChEMBL_635680 (CHEMBL1119709)
IC50 65±n/a nM
Citation Höfgen, NStange, HSchindler, RLankau, HJGrunwald, CLangen, BEgerland, UTremmel, PPangalos, MNMarquis, KLHage, THarrison, BLMalamas, MSBrandon, NJKronbach, T Discovery of imidazo[1,5-a]pyrido[3,2-e]pyrazines as a new class of phosphodiesterase 10A inhibitiors. J Med Chem53:4399-411 (2010) 
 
cAMP and cAMP-inhibited cGMP 3',5'-cyclic phosphodiesterase 10A
Name:cAMP and cAMP-inhibited cGMP 3',5'-cyclic phosphodiesterase 10A
Type:Protein
Mol. Mass.:88412.52
Organism:Homo sapiens (Human)
Description:Q9Y233
Residue:779
BDBM50319187
NameBDBM50319187
Synonyms:1-Ethyl-8-methoxy-3-methyl-4-methylsulfonylamino-imidazo[1,5-a]pyrido[3,2-e]pyrazine | CHEMBL1083266
TypeSmall organic molecule
Emp. Form.C14H17N5O3S
Mol. Mass.335.381
SMILESCCc1nc(C)c2c(NS(C)(=O)=O)nc3ccc(OC)nc3n12