Reaction Details
TargetcGMP-dependent 3',5'-cyclic phosphodiesterase
LigandBDBM50319163
Substrate/Competitorn/a
Meas. Tech.ChEMBL_635685 (CHEMBL1119714)
IC50 1000±n/a nM
Citation Höfgen, NStange, HSchindler, RLankau, HJGrunwald, CLangen, BEgerland, UTremmel, PPangalos, MNMarquis, KLHage, THarrison, BLMalamas, MSBrandon, NJKronbach, T Discovery of imidazo[1,5-a]pyrido[3,2-e]pyrazines as a new class of phosphodiesterase 10A inhibitiors. J Med Chem53:4399-411 (2010) 
 
cGMP-dependent 3',5'-cyclic phosphodiesterase
Name:cGMP-dependent 3',5'-cyclic phosphodiesterase
Type:Enzyme Catalytic Domain
Mol. Mass.:105691.58
Organism:Homo sapiens (Human)
Description:O00408
Residue:941
BDBM50319163
NameBDBM50319163
Synonyms:8-Methoxy-3-methyl-4-methylsulfonylamino-1-propyl-imidazo[1,5-a]pyrido[3,2-e]pyrazine | CHEMBL1085374
TypeSmall organic molecule
Emp. Form.C15H19N5O3S
Mol. Mass.349.408
SMILESCCCc1nc(C)c2c(NS(C)(=O)=O)nc3ccc(OC)nc3n12