Reaction Details
TargetHistone deacetylase 5
LigandBDBM50319209
Substrate/Competitorn/a
Meas. Tech.ChEMBL_633820 (CHEMBL1119898)
Ki 13±n/a nM
Citation Wang, HLim, ZYZhou, YNg, MLu, TLee, KSangthongpitag, KGoh, KCWang, XWu, XKhng, HHGoh, SKOng, WCBonday, ZSun, ET Acylurea connected straight chain hydroxamates as novel histone deacetylase inhibitors: Synthesis, SAR, and in vivo antitumor activity. Bioorg Med Chem Lett20:3314-21 (2010) 
 
Histone deacetylase 5
Name:Histone deacetylase 5
Type:Enzyme
Mol. Mass.:121968.61
Organism:Homo sapiens (Human)
Description:Q9UQL6
Residue:1122
BDBM50319209
NameBDBM50319209
Synonyms:6-[3-(4-Bromo-benzoyl)-ureido]-hexanoic acid hydroxyamide | CHEMBL1083086
TypeSmall organic molecule
Emp. Form.C14H18BrN3O4
Mol. Mass.372.214
SMILESONC(=O)CCCCCNC(=O)NC(=O)c1ccc(Br)cc1