Reaction Details
TargetHistone deacetylase 1
LigandBDBM50319227
Substrate/Competitorn/a
Meas. Tech.ChEMBL_633815 (CHEMBL1119893)
IC50 9700±n/a nM
Citation Wang, HLim, ZYZhou, YNg, MLu, TLee, KSangthongpitag, KGoh, KCWang, XWu, XKhng, HHGoh, SKOng, WCBonday, ZSun, ET Acylurea connected straight chain hydroxamates as novel histone deacetylase inhibitors: Synthesis, SAR, and in vivo antitumor activity. Bioorg Med Chem Lett20:3314-21 (2010) 
 
Histone deacetylase 1
Name:Histone deacetylase 1
Type:Enzyme
Mol. Mass.:55090.27
Organism:Homo sapiens (Human)
Description:Q13547
Residue:482
BDBM50319227
NameBDBM50319227
Synonyms:6-[3-(1-Phenethyl-1H-benzimidazole-5-carbonyl)-ureido]-hexanoic acid hydroxyamide | CHEMBL1086548
TypeSmall organic molecule
Emp. Form.C23H27N5O4
Mol. Mass.437.4916
SMILESONC(=O)CCCCCNC(=O)NC(=O)c1ccc2n(CCc3ccccc3)cnc2c1