Reaction Details
TargetHistone deacetylase 1
LigandBDBM50319231
Substrate/Competitorn/a
Meas. Tech.ChEMBL_633815 (CHEMBL1119893)
IC50 3700±n/a nM
Citation Wang, HLim, ZYZhou, YNg, MLu, TLee, KSangthongpitag, KGoh, KCWang, XWu, XKhng, HHGoh, SKOng, WCBonday, ZSun, ET Acylurea connected straight chain hydroxamates as novel histone deacetylase inhibitors: Synthesis, SAR, and in vivo antitumor activity. Bioorg Med Chem Lett20:3314-21 (2010) 
 
Histone deacetylase 1
Name:Histone deacetylase 1
Type:Enzyme
Mol. Mass.:55090.27
Organism:Homo sapiens (Human)
Description:Q13547
Residue:482
BDBM50319231
NameBDBM50319231
Synonyms:6-{3-[1-(3-Dimethylamino-2,2-dimethyl-propyl)-1H-benzoimidazole-5-carbonyl]-ureido}-hexanoicacid hydroxyamide | CHEMBL1084356
TypeSmall organic molecule
Emp. Form.C22H34N6O4
Mol. Mass.446.5432
SMILESCN(C)CC(C)(C)Cn1cnc2cc(ccc12)C(=O)NC(=O)NCCCCCC(=O)NO