Reaction Details
TargetHistone deacetylase 1
LigandBDBM50319233
Substrate/Competitorn/a
Meas. Tech.ChEMBL_633815 (CHEMBL1119893)
IC50 2910±n/a nM
Citation Wang, HLim, ZYZhou, YNg, MLu, TLee, KSangthongpitag, KGoh, KCWang, XWu, XKhng, HHGoh, SKOng, WCBonday, ZSun, ET Acylurea connected straight chain hydroxamates as novel histone deacetylase inhibitors: Synthesis, SAR, and in vivo antitumor activity. Bioorg Med Chem Lett20:3314-21 (2010) 
 
Histone deacetylase 1
Name:Histone deacetylase 1
Type:Enzyme
Mol. Mass.:55090.27
Organism:Homo sapiens (Human)
Description:Q13547
Residue:482
BDBM50319233
NameBDBM50319233
Synonyms:6-{3-[2-Butyl-1-(2-pyrrolidin-1-yl-ethyl)-1H-benzimidazole-5-carbonyl]-ureido}-hexanoic acidhydroxyamide | CHEMBL1084624
TypeSmall organic molecule
Emp. Form.C25H38N6O4
Mol. Mass.486.607
SMILESCCCCc1nc2cc(ccc2n1CCN1CCCC1)C(=O)NC(=O)NCCCCCC(=O)NO