Reaction Details
TargetHistone deacetylase 4
LigandBDBM50319235
Substrate/Competitorn/a
Meas. Tech.ChEMBL_633819 (CHEMBL1119897)
Ki 20±n/a nM
Citation Wang, HLim, ZYZhou, YNg, MLu, TLee, KSangthongpitag, KGoh, KCWang, XWu, XKhng, HHGoh, SKOng, WCBonday, ZSun, ET Acylurea connected straight chain hydroxamates as novel histone deacetylase inhibitors: Synthesis, SAR, and in vivo antitumor activity. Bioorg Med Chem Lett20:3314-21 (2010) 
 
Histone deacetylase 4
Name:Histone deacetylase 4
Type:Enzyme
Mol. Mass.:119049.39
Organism:Homo sapiens (Human)
Description:P56524
Residue:1084
BDBM50319235
NameBDBM50319235
Synonyms:6-(3-Benzoyl-ureido)-hexanoic acid hydroxyamide | CHEMBL1083439
TypeSmall organic molecule
Emp. Form.C14H19N3O4
Mol. Mass.293.3184
SMILESONC(=O)CCCCCNC(=O)NC(=O)c1ccccc1