Reaction Details
TargetHydroxycarboxylic acid receptor 2
LigandBDBM50319261
Substrate/Competitorn/a
Meas. Tech.ChEMBL_633873 (CHEMBL1120319)
IC50 5±n/a nM
Citation Ding, FXShen, HCWilsie, LCKrsmanovic, MLTaggart, AKRen, NCai, TQWang, JTong, XHolt, TGChen, QWaters, MGHammond, MLTata, JRColletti, SL Discovery of pyrazolyl propionyl cyclohexenamide derivatives as full agonists for the high affinity niacin receptor GPR109A. Bioorg Med Chem Lett20:3372-5 (2010) 
 
Hydroxycarboxylic acid receptor 2
Name:Hydroxycarboxylic acid receptor 2
Type:G Protein-Coupled Receptor (GPCR)
Mol. Mass.:41868.22
Organism:Homo sapiens (Human)
Description:Membranes from CHO cells expressing the recombinant human GPR109A were used in competition binding assay.
Residue:363
BDBM50319261
NameBDBM50319261
Synonyms:2-(3-(1-(5-hydroxypyridin-2-yl)-1H-pyrazol-3-yl)propanamido)cyclohex-1-enecarboxylicacid | CHEMBL1085156
TypeSmall organic molecule
Emp. Form.C18H20N4O4
Mol. Mass.356.3758
SMILESOC(=O)C1=C(CCCC1)NC(=O)CCc1ccn(n1)-c1ccc(O)cn1