Reaction Details
TargetPeroxisome proliferator-activated receptor alpha
LigandBDBM50319270
Substrate/Competitorn/a
Meas. Tech.ChEMBL_633996 (CHEMBL1117969)
EC50 600±n/a nM
Citation Urbahns, KWoltering, MNikolic, SPernerstorfer, JBischoff, HDittrich-Wengenroth, ELustig, K Glycine amides as PPARalpha agonists. Bioorg Med Chem Lett20:3376-9 (2010) 
 
Peroxisome proliferator-activated receptor alpha
Name:Peroxisome proliferator-activated receptor alpha
Type:Enzyme
Mol. Mass.:52222.08
Organism:Homo sapiens (Human)
Description:Q07869
Residue:468
BDBM50319270
NameBDBM50319270
Synonyms:2-(4-(((2-(2,5-dimethylphenylamino)-2-oxoethyl)(furan-2-ylmethyl)amino)methyl)phenoxy)-2-methylpropanoic acid | CHEMBL1084320
TypeSmall organic molecule
Emp. Form.C26H30N2O5
Mol. Mass.450.5268
SMILESCc1ccc(C)c(NC(=O)CN(Cc2ccco2)Cc2ccc(OC(C)(C)C(O)=O)cc2)c1