Reaction Details
TargetHistamine H4 receptor
LigandBDBM50319284
Substrate/Competitorn/a
Meas. Tech.ChEMBL_634016 (CHEMBL1117989)
Ki 1000±n/a nM
Citation Savall, BMEdwards, JPVenable, JDBuzard, DJThurmond, RHack, MMcGovern, P Agonist/antagonist modulation in a series of 2-aryl benzimidazole H4 receptor ligands. Bioorg Med Chem Lett20:3367-71 (2010) 
 
Histamine H4 receptor
Name:Histamine H4 receptor
Type:G Protein-Coupled Receptor (GPCR)
Mol. Mass.:44517.02
Organism:Homo sapiens (Human)
Description:Binding assays were using CHO cells stably expressing hH4R receptors.
Residue:390
BDBM50319284
NameBDBM50319284
Synonyms:(+/-)-5-fluoro-4-methyl-2-(2-methyl-4-(3-(1-methyltetrahydro-1H-pyrrolo[3,4-b]pyridin-6(2H,7H,7aH)-yl)propoxy)phenyl)-1H-benzo[d]imidazole | CHEMBL1084811
TypeSmall organic molecule
Emp. Form.C26H33FN4O
Mol. Mass.436.5648
SMILESCN1CCCC2CN(CCCOc3ccc(-c4nc5ccc(F)c(C)c5[nH]4)c(C)c3)CC12