Reaction Details
TargetHistamine H4 receptor
LigandBDBM50319287
Substrate/Competitorn/a
Meas. Tech.ChEMBL_634016 (CHEMBL1117989)
Ki 26±n/a nM
Citation Savall, BMEdwards, JPVenable, JDBuzard, DJThurmond, RHack, MMcGovern, P Agonist/antagonist modulation in a series of 2-aryl benzimidazole H4 receptor ligands. Bioorg Med Chem Lett20:3367-71 (2010) 
 
Histamine H4 receptor
Name:Histamine H4 receptor
Type:G Protein-Coupled Receptor (GPCR)
Mol. Mass.:44517.02
Organism:Homo sapiens (Human)
Description:Binding assays were using CHO cells stably expressing hH4R receptors.
Residue:390
BDBM50319287
NameBDBM50319287
Synonyms:(+/-)-5-fluoro-2-(4-(3-(hexahydropyrrolo[3,4-b]pyrrol-5(1H)-yl)propoxy)-2-methylphenyl)-4-methyl-1H-benzo[d]imidazole | CHEMBL1083098
TypeSmall organic molecule
Emp. Form.C24H29FN4O
Mol. Mass.408.5117
SMILESCc1cc(OCCCN2CC3CCNC3C2)ccc1-c1nc2ccc(F)c(C)c2[nH]1