Reaction Details
TargetHistamine H4 receptor
LigandBDBM50319294
Substrate/Competitorn/a
Meas. Tech.ChEMBL_634017 (CHEMBL1117990)
EC50 710±n/a nM
Citation Savall, BMEdwards, JPVenable, JDBuzard, DJThurmond, RHack, MMcGovern, P Agonist/antagonist modulation in a series of 2-aryl benzimidazole H4 receptor ligands. Bioorg Med Chem Lett20:3367-71 (2010) 
 
Histamine H4 receptor
Name:Histamine H4 receptor
Type:G Protein-Coupled Receptor (GPCR)
Mol. Mass.:44517.02
Organism:Homo sapiens (Human)
Description:Binding assays were using CHO cells stably expressing hH4R receptors.
Residue:390
BDBM50319294
NameBDBM50319294
Synonyms:(+/-)-5-fluoro-4-methyl-2-(2-methyl-4-(3-(3-methyl-3,6-diazabicyclo[3.1.0]hexan-6-yl)propoxy)phenyl)-1H-benzo[d]imidazole | CHEMBL1086085
TypeSmall organic molecule
Emp. Form.C23H27FN4O
Mol. Mass.394.4851
SMILESCN1CC2C(C1)N2CCCOc1ccc(-c2nc3ccc(F)c(C)c3[nH]2)c(C)c1