Reaction Details
TargetHistamine H1 receptor
LigandBDBM50319300
Substrate/Competitorn/a
Meas. Tech.ChEMBL_634018 (CHEMBL1117991)
EC50>10000±n/a nM
Citation Savall, BMEdwards, JPVenable, JDBuzard, DJThurmond, RHack, MMcGovern, P Agonist/antagonist modulation in a series of 2-aryl benzimidazole H4 receptor ligands. Bioorg Med Chem Lett20:3367-71 (2010) 
 
Histamine H1 receptor
Name:Histamine H1 receptor
Type:G Protein-Coupled Receptor (GPCR)
Mol. Mass.:55808.72
Organism:Homo sapiens (Human)
Description:Cell pellets from SK-N-MC cells transfected with human H1 receptor were used in binding assay.
Residue:487
BDBM50319300
NameBDBM50319300
Synonyms:CHEMBL1083162 | N-(2-(1H-imidazol-4-yl)ethyl)-3-(4-(5-fluoro-4-methyl-1H-benzo[d]imidazol-2-yl)-3-methylphenoxy)propan-1-amine
TypeSmall organic molecule
Emp. Form.C23H26FN5O
Mol. Mass.407.4838
SMILESCc1cc(OCCCNCCc2cnc[nH]2)ccc1-c1nc2ccc(F)c(C)c2[nH]1