Reaction Details
TargetHistamine H4 receptor
LigandBDBM50319285
Substrate/Competitorn/a
Meas. Tech.ChEMBL_634021 (CHEMBL1117994)
EC50 1197±n/a nM
Citation Savall, BMEdwards, JPVenable, JDBuzard, DJThurmond, RHack, MMcGovern, P Agonist/antagonist modulation in a series of 2-aryl benzimidazole H4 receptor ligands. Bioorg Med Chem Lett20:3367-71 (2010) 
 
Histamine H4 receptor
Name:Histamine H4 receptor
Type:G Protein-Coupled Receptor (GPCR)
Mol. Mass.:44272.75
Organism:Mus musculus (mouse)
Description:Cell pellets from SK-N-MC cells transfected with mouse H4 receptor were used in binding assay.
Residue:391
BDBM50319285
NameBDBM50319285
Synonyms:5-fluoro-4-methyl-2-(2-methyl-4-(3-((4aR,7aR)-tetrahydro-1H-pyrrolo[3,4-b]pyridin-6(2H,7H,7aH)-yl)propoxy)phenyl)-1H-benzo[d]imidazole | CHEMBL1082296
TypeSmall organic molecule
Emp. Form.C25H31FN4O
Mol. Mass.422.5382
SMILESCc1cc(OCCCN2C[C@H]3CCCN[C@H]3C2)ccc1-c1nc2ccc(F)c(C)c2[nH]1