Reaction Details
TargetHistamine H4 receptor
LigandBDBM50319303
Substrate/Competitorn/a
Meas. Tech.ChEMBL_634016 (CHEMBL1117989)
Ki 150±n/a nM
Citation Savall, BMEdwards, JPVenable, JDBuzard, DJThurmond, RHack, MMcGovern, P Agonist/antagonist modulation in a series of 2-aryl benzimidazole H4 receptor ligands. Bioorg Med Chem Lett20:3367-71 (2010) 
 
Histamine H4 receptor
Name:Histamine H4 receptor
Type:G Protein-Coupled Receptor (GPCR)
Mol. Mass.:44517.02
Organism:Homo sapiens (Human)
Description:Binding assays were using CHO cells stably expressing hH4R receptors.
Residue:390
BDBM50319303
NameBDBM50319303
Synonyms:(+/-)-3-(4-(5-fluoro-4-methyl-1H-benzo[d]imidazol-2-yl)-3-methylphenoxy)-N-(piperidin-2-ylmethyl)propan-1-amine | CHEMBL1086327
TypeSmall organic molecule
Emp. Form.C24H31FN4O
Mol. Mass.410.5275
SMILESCc1cc(OCCCNCC2CCCCN2)ccc1-c1nc2ccc(F)c(C)c2[nH]1